Target
Inositol 1,4,5-trisphosphate receptor type 1
Ligand
BDBM50323711
Substrate
Meas. Tech.
ChEMBL_645183 (CHEMBL1218399)
Kd
43.6±n/a nM
Citation
 Rossi, AMRiley, AMTovey, SCRahman, TDellis, OTaylor, EJVeresov, VGPotter, BVTaylor, CW Synthetic partial agonists reveal key steps in IP3 receptor activation. Nat Chem Biol 5:631-9 (2009)  
Target
Name:
Inositol 1,4,5-trisphosphate receptor type 1
Synonyms:
ITPR1_RAT Itpr1
Type:
PROTEIN
Mol. Mass.:
313234.63
Organism:
Rattus norvegicus
Description:
ChEMBL_818416
Residue:
2750
  
Inhibitor
Name:
BDBM50323711
Synonyms:
(1R,2R,3S,4S,5R,6S)-5-(2-aminoethoxy)-3,6-dihydroxycyclohexane-1,2,4-triyl triphosphate | CHEMBL1213202
Type:
Small organic molecule
Emp. Form.:
C8H20NO15P3
Mol. Mass.:
463.1634
SMILES:
NCCO[C@@H]1[C@H](O)[C@@H](OP(O)(O)=O)[C@H](OP(O)(O)=O)[C@@H](O)[C@@H]1OP(O)(O)=O
: