Target
Inositol 1,4,5-trisphosphate receptor type 1
Ligand
BDBM50323707
Substrate
Meas. Tech.
ChEMBL_645185 (CHEMBL1218401)
Kd
0.36±n/a nM
Citation
 Rossi, AMRiley, AMTovey, SCRahman, TDellis, OTaylor, EJVeresov, VGPotter, BVTaylor, CW Synthetic partial agonists reveal key steps in IP3 receptor activation. Nat Chem Biol 5:631-9 (2009)  
Target
Name:
Inositol 1,4,5-trisphosphate receptor type 1
Synonyms:
ITPR1_RAT Itpr1
Type:
PROTEIN
Mol. Mass.:
313234.63
Organism:
Rattus norvegicus
Description:
ChEMBL_818416
Residue:
2750
  
Inhibitor
Name:
BDBM50323707
Synonyms:
CHEMBL1213160
Type:
Small organic molecule
Emp. Form.:
C17H42N2O37P8
Mol. Mass.:
1114.2967
SMILES:
O[C@H]1[C@@H](OCCNC(=O)NCCO[C@@H]2[C@H](OP(O)(O)=O)[C@@H](OP(O)(O)=O)[C@H](OP(O)(O)O)[C@@H](OP(O)(O)=O)[C@@H]2OP(O)(O)=O)[C@@H](OP(O)(O)=O)[C@H](O)[C@@H](OP(O)(O)=O)[C@@H]1OP(O)(O)=O
: