Target
Inositol 1,4,5-trisphosphate receptor type 1
Ligand
BDBM50323708
Substrate
Meas. Tech.
ChEMBL_645186 (CHEMBL1218402)
Kd
0.33±n/a nM
Citation
 Rossi, AMRiley, AMTovey, SCRahman, TDellis, OTaylor, EJVeresov, VGPotter, BVTaylor, CW Synthetic partial agonists reveal key steps in IP3 receptor activation. Nat Chem Biol 5:631-9 (2009)  
Target
Name:
Inositol 1,4,5-trisphosphate receptor type 1
Synonyms:
ITPR1_RAT Itpr1
Type:
PROTEIN
Mol. Mass.:
313234.63
Organism:
Rattus norvegicus
Description:
ChEMBL_818416
Residue:
2750
  
Inhibitor
Name:
BDBM50323708
Synonyms:
CHEMBL1213161
Type:
Small organic molecule
Emp. Form.:
C17H35N2O22P3
Mol. Mass.:
712.3813
SMILES:
O[C@H]1[C@H](O)[C@@H](O)[C@@H](OCCNC(=O)NCCO[C@@H]2[C@H](O)[C@@H](OP(O)(O)=O)[C@H](OP(O)(O)=O)[C@@H](O)[C@@H]2OP(O)(O)=O)[C@@H](O)[C@@H]1O
: