Target
Inositol 1,4,5-trisphosphate receptor type 1
Ligand
BDBM50323709
Substrate
Meas. Tech.
ChEMBL_645186 (CHEMBL1218402)
Kd
0.2±n/a nM
Citation
 Rossi, AMRiley, AMTovey, SCRahman, TDellis, OTaylor, EJVeresov, VGPotter, BVTaylor, CW Synthetic partial agonists reveal key steps in IP3 receptor activation. Nat Chem Biol 5:631-9 (2009)  
Target
Name:
Inositol 1,4,5-trisphosphate receptor type 1
Synonyms:
ITPR1_RAT Itpr1
Type:
PROTEIN
Mol. Mass.:
313234.63
Organism:
Rattus norvegicus
Description:
ChEMBL_818416
Residue:
2750
  
Inhibitor
Name:
BDBM50323709
Synonyms:
CHEMBL1213163
Type:
Small organic molecule
Emp. Form.:
C19H34NO16P3
Mol. Mass.:
625.3916
SMILES:
O[C@H]1[C@@H](OCCNC(=O)C23CC4CC(CC(C4)C2)C3)[C@@H](OP(O)(O)=O)[C@H](O)[C@@H](OP(O)(O)=O)[C@@H]1OP(O)(O)=O
: