Target
Hydroxycarboxylic acid receptor 3
Ligand
BDBM50325913
Substrate
Meas. Tech.
ChEMBL_652723 (CHEMBL1225926)
IC50
33000±n/a nM
Citation
 Peters, JUKühne, HDehmlow, HGrether, UConte, AHainzl, DHertel, CKratochwil, NAOtteneder, MNarquizian, RPanousis, CGRicklin, FRöver, S Pyrido pyrimidinones as selective agonists of the high affinity niacin receptor GPR109A: optimization of in vitro activity. Bioorg Med Chem Lett 20:5426-30 (2010)  
Target
Name:
Hydroxycarboxylic acid receptor 3
Synonyms:
G-protein coupled receptor 109B G-protein coupled receptor HM74B HCA3 HCAR3_HUMAN HM74B NIACR2 Nicotinic acid receptor 2
Type:
Enzyme Catalytic Domain
Mol. Mass.:
44498.06
Organism:
Homo sapiens (Human)
Description:
GPR109B 0 HUMAN::P49019
Residue:
387
  
Inhibitor
Name:
BDBM50325913
Synonyms:
2-(3-(2-chlorophenoxy)propoxy)pyrido[2,3-d]pyrimidin-4(3H)-one | CHEMBL1224070
Type:
Small organic molecule
Emp. Form.:
C16H14ClN3O3
Mol. Mass.:
331.754
SMILES:
Clc1ccccc1OCCCOc1nc2ncccc2c(=O)[nH]1
: