Target
Protein kinase C eta type
Ligand
BDBM50327945
Substrate
Meas. Tech.
ChEMBL_665136 (CHEMBL1260399)
Ki
180±n/a nM
Citation
 Yanagita, RCKamachi, HTanaka, KMurakami, ANakagawa, YTokuda, HNagai, HIrie, K Role of the phenolic hydroxyl group in the biological activities of simplified analogue of aplysiatoxin with antiproliferative activity. Bioorg Med Chem Lett 20:6064-6 (2010)  
Target
Name:
Protein kinase C eta type
Synonyms:
KPCL_HUMAN PKCL PRKCL Protein kinase C, PKC; classical/novel | nPKC-eta
Type:
Enzyme
Mol. Mass.:
77844.26
Organism:
Homo sapiens (Human)
Description:
The recombinant human PKC enzymes were produced using a baculovirus expression system in SF9 cells
Residue:
683
  
Inhibitor
Name:
BDBM50327945
Synonyms:
(1R,3R,5R,9R,13R)-9-Hydroxymethyl-3-(4-phenyl-butyl)-2,6,10,17-tetraoxa-tricyclo[11.3.1.1'1,5']octadecane-7,11-dione | CHEMBL1258349
Type:
Small organic molecule
Emp. Form.:
C25H34O7
Mol. Mass.:
446.5333
SMILES:
OC[C@H]1CC(=O)O[C@@H]2C[C@@H](CCCCc3ccccc3)O[C@@]3(CCC[C@H](CC(=O)O1)O3)C2
: