Target
Potassium voltage-gated channel subfamily H member 2
Ligand
BDBM50330095
Substrate
Meas. Tech.
ChEMBL_676113 (CHEMBL1273164)
IC50
>10000±n/a nM
Citation
 Pryde, DCJones, RMiddleton, DSLaverty, BJFenwick, DRMason, HJCorless, MSmith, NN An in situ oxidation strategy towards overcoming hERG affinity. Bioorg Med Chem Lett 20:6400-4 (2010)  
Target
Name:
Potassium voltage-gated channel subfamily H member 2
Synonyms:
1,3-beta-glucan synthase component GLS2 ERG Eag-related protein 1 Ether-a-go-go-related gene (HERG) Ether-a-go-go-related gene potassium channel 1 Ether-a-go-go-related gene potassium channel 1 (hERG1) Ether-a-go-go-related protein 1 H-ERG KCNH2 Potassium voltage-gated channel subfamily H member 2 (hERG) Voltage-gated potassium channel subunit Kv11.1 hERG Potassium Channel 1 | putative potassium channel subunit
Type:
Multi-pass membrane protein
Mol. Mass.:
126672.65
Organism:
Homo sapiens (Human)
Description:
Q12809
Residue:
1159
  
Inhibitor
Name:
BDBM50330095
Synonyms:
1,1-Dioxo-hexahydro-1lambda*6*-thiopyran-4-carboxylic acid [3-[(1S,5R)-3-(6-fluoro-2-methyl-benzoimidazol-1-yl)-8-aza-bicyclo[3.2.1]oct-8-yl]-1-(3-fluoro-phenyl)-propyl]-amide | CHEMBL1269335
Type:
Small organic molecule
Emp. Form.:
C30H36F2N4O3S
Mol. Mass.:
570.694
SMILES:
Cc1nc2ccc(F)cc2n1C1C[C@@H]2CC[C@H](C1)N2CC[C@H](NC(=O)C1CCS(=O)(=O)CC1)c1cccc(F)c1
: