Target
Potassium voltage-gated channel subfamily H member 2
Ligand
BDBM50330096
Substrate
Meas. Tech.
ChEMBL_676113 (CHEMBL1273164)
IC50
740±n/a nM
Citation
 Pryde, DCJones, RMiddleton, DSLaverty, BJFenwick, DRMason, HJCorless, MSmith, NN An in situ oxidation strategy towards overcoming hERG affinity. Bioorg Med Chem Lett 20:6400-4 (2010)  
Target
Name:
Potassium voltage-gated channel subfamily H member 2
Synonyms:
1,3-beta-glucan synthase component GLS2 ERG Eag-related protein 1 Ether-a-go-go-related gene (HERG) Ether-a-go-go-related gene potassium channel 1 Ether-a-go-go-related gene potassium channel 1 (hERG1) Ether-a-go-go-related protein 1 H-ERG KCNH2 Potassium voltage-gated channel subfamily H member 2 (hERG) Voltage-gated potassium channel subunit Kv11.1 hERG Potassium Channel 1 | putative potassium channel subunit
Type:
Multi-pass membrane protein
Mol. Mass.:
126672.65
Organism:
Homo sapiens (Human)
Description:
Q12809
Residue:
1159
  
Inhibitor
Name:
BDBM50330096
Synonyms:
CHEMBL1271606 | N-((1S)-1-(3-fluorophenyl)-3-((1R,5S)-3-(2-methyl-1H-benzo[d]imidazol-1-yl)-8-azabicyclo[3.2.1]octan-8-yl)propyl)tetrahydro-2H-thiopyran-4-carboxamide
Type:
Small organic molecule
Emp. Form.:
C30H37FN4OS
Mol. Mass.:
520.704
SMILES:
Cc1nc2ccccc2n1C1C[C@@H]2CC[C@H](C1)N2CC[C@H](NC(=O)C1CCSCC1)c1cccc(F)c1
: