Target
5-hydroxytryptamine receptor 6
Ligand
BDBM50330507
Substrate
Meas. Tech.
ChEMBL_684952 (CHEMBL1286367)
Ki
0.9±n/a nM
Citation
 Liu, KGRobichaud, AJBernotas, RCYan, YLo, JRZhang, MYHughes, ZAHuselton, CZhang, GMZhang, JYKowal, DMSmith, DLSchechter, LEComery, TA 5-Piperazinyl-3-sulfonylindazoles as potent and selective 5-hydroxytryptamine-6 antagonists. J Med Chem 53:7639-46 (2010)  
Target
Name:
5-hydroxytryptamine receptor 6
Synonyms:
5-HT-6 5-hydroxytryptamine receptor 6 (5-HT-6) 5-hydroxytryptamine receptor 6 (5HT6) HTR6 Serotonin 6 (5-HT6) receptor | Serotonin Receptor 6
Type:
G Protein-Coupled Receptor (GPCR)
Mol. Mass.:
46968.43
Organism:
Homo sapiens (Human)
Description:
P50406
Residue:
440
  
Inhibitor
Name:
BDBM50330507
Synonyms:
5-(4-Methylpiperazin-1-yl)-3-(m-tolylsulfonyl)-1H-indazole | CHEMBL1276925
Type:
Small organic molecule
Emp. Form.:
C19H22N4O2S
Mol. Mass.:
370.469
SMILES:
CN1CCN(CC1)c1ccc2[nH]nc(c2c1)S(=O)(=O)c1cccc(C)c1
: