Target
Alpha-2A adrenergic receptor
Ligand
BDBM50330512
Substrate
Meas. Tech.
ChEMBL_684961 (CHEMBL1286376)
Ki
>5000±n/a nM
Citation
 Liu, KGRobichaud, AJBernotas, RCYan, YLo, JRZhang, MYHughes, ZAHuselton, CZhang, GMZhang, JYKowal, DMSmith, DLSchechter, LEComery, TA 5-Piperazinyl-3-sulfonylindazoles as potent and selective 5-hydroxytryptamine-6 antagonists. J Med Chem 53:7639-46 (2010)  
Target
Name:
Alpha-2A adrenergic receptor
Synonyms:
ADA2A_HUMAN ADRA2R Adrenergic alpha2A Alpha-2 adrenergic receptor subtype C10 Alpha-2A adrenoreceptor alpha-2A adrenergic receptor [Homo sapiens]
Type:
Enzyme
Mol. Mass.:
48979.91
Organism:
Homo sapiens (Human)
Description:
P08913
Residue:
465
  
Inhibitor
Name:
BDBM50330512
Synonyms:
3-(Naphthalen-1-ylsulfonyl)-5-(piperazin-1-yl)-1H-indazole | CHEMBL1277105
Type:
Small organic molecule
Emp. Form.:
C21H20N4O2S
Mol. Mass.:
392.474
SMILES:
O=S(=O)(c1n[nH]c2ccc(cc12)N1CCNCC1)c1cccc2ccccc12
: