Target
Glutamate receptor ionotropic, NMDA 1/2B
Ligand
BDBM50331296
Substrate
Meas. Tech.
ChEMBL_686641 (CHEMBL1292494)
Ki
41±n/a nM
Citation
 Tewes, BFrehland, BSchepmann, DSchmidtke, KUWinckler, TWünsch, B Conformationally constrained NR2B selective NMDA receptor antagonists derived from ifenprodil: Synthesis and biological evaluation of tetrahydro-3-benzazepine-1,7-diols. Bioorg Med Chem 18:8005-15 (2010)  
Target
Name:
Glutamate receptor ionotropic, NMDA 1/2B
Synonyms:
GluN1/GluN2B NMDA receptor Glutamate [NMDA] receptor subunit epsilon 2/zeta 1 nr2b nam
Type:
Enzyme
Mol. Mass.:
Description:
Components:
This complex has 2 components.
Component 1
Name:
Glutamate receptor ionotropic, NMDA 1
Synonyms:
GRIN1 Glutamate [NMDA] receptor subunit zeta-1 N-methyl-D-aspartate receptor subunit NR1 NMDZ1_HUMAN | phencyclidine
Type:
Enzyme Catalytic Domain
Mol. Mass.:
105397.81
Organism:
Homo sapiens (Human)
Description:
Q05586
Residue:
938
  
Component 2
Name:
Glutamate receptor ionotropic, NMDA 2B
Synonyms:
GRIN2B Glutamate [NMDA] receptor subunit epsilon 2 N-methyl D-aspartate receptor subtype 2B NMDAR2B NR3 | hNR3
Type:
PROTEIN
Mol. Mass.:
166375.46
Organism:
Homo sapiens (Human)
Description:
ChEMBL_1438829
Residue:
1484
  
Inhibitor
Name:
BDBM50331296
Synonyms:
(+/-)-7-Benzyloxy-3-(3-phenoxypropyl)-2,3,4,5-tetrahydro-1H-3-benzazepin-1-ol | CHEMBL1290159
Type:
Small organic molecule
Emp. Form.:
C26H29NO2S
Mol. Mass.:
419.579
SMILES:
OC1CN(CCCSc2ccccc2)CCc2cc(OCc3ccccc3)ccc12
: