Target
Prostaglandin G/H synthase 2
Ligand
BDBM50331320
Substrate
Meas. Tech.
ChEMBL_686949 (CHEMBL1291360)
IC50
1180±n/a nM
Citation
 Lim, CLee, MPark, EJCho, RPark, HJLee, SJCho, HLee, SKKim, S Sulfonamide derivatives of styrylheterocycles as a potent inhibitor of COX-2-mediated prostaglandin E2 production. Bioorg Med Chem Lett 20:6938-41 (2010)  
Target
Name:
Prostaglandin G/H synthase 2
Synonyms:
Cox-2 Cyclooxygenase-2 Glucocorticoid-regulated inflammatory cyclooxygenase Macrophage activation-associated marker protein P71/73 PGH synthase 2 PGHS-2 Pghs-b Prostaglandin H2 synthase 2 Ptgs2 Tis10
Type:
Protein
Mol. Mass.:
69020.39
Organism:
Mus musculus (Mouse)
Description:
Q05769
Residue:
604
  
Inhibitor
Name:
BDBM50331320
Synonyms:
(E)-2-(4-(methylsulfonyl)styryl)furan | CHEMBL1288742
Type:
Small organic molecule
Emp. Form.:
C13H12O3S
Mol. Mass.:
248.298
SMILES:
CS(=O)(=O)c1ccc(\C=C\c2ccco2)cc1
: