Target
D(3) dopamine receptor
Ligand
BDBM50132047
Substrate
Meas. Tech.
ChEMBL_687312 (CHEMBL1291988)
Ki
0.44±n/a nM
Citation
 Höfling, SBMaschauer, SHübner, HGmeiner, PWester, HJPrante, OHeinrich, MR Synthesis, biological evaluation and radiolabelling by 18F-fluoroarylation of a dopamine D3-selective ligand as prospective imaging probe for PET. Bioorg Med Chem Lett 20:6933-7 (2010)  
Target
Name:
D(3) dopamine receptor
Synonyms:
DOPAMINE D3 DRD3_HUMAN Dopamine D3 receptor (D3) Dopamine receptor Dopamine receptor D3
Type:
Mol. Mass.:
44243.43
Organism:
Homo sapiens (Human)
Description:
Residue:
400
  
Inhibitor
Name:
BDBM50132047
Synonyms:
3-(4-Chloro-phenyl)-N-{4-[4-(2-methoxy-phenyl)-piperazin-1-yl]-butyl}-acrylamide; oxalic acid CHEMBL126725
Type:
Small organic molecule
Emp. Form.:
C24H30ClN3O2
Mol. Mass.:
427.967
SMILES:
COc1ccccc1N1CCN(CCCCNC(=O)\C=C\c2ccc(Cl)cc2)CC1
: