Target
Low molecular weight protein-tyrosine phosphatase A
Ligand
BDBM50331860
Substrate
Meas. Tech.
ChEMBL_686940 (CHEMBL1291351)
Ki
85500±n/a nM
Citation
 Chandra, KDutta, DDas, AKBasak, A Design, synthesis and inhibition activity of novel cyclic peptides against protein tyrosine phosphatase A from Mycobacterium tuberculosis. Bioorg Med Chem 18:8365-73 (2010)  
Target
Name:
Low molecular weight protein-tyrosine phosphatase A
Synonyms:
PTPA_MYCTU Probable low molecular weight protein-tyrosine-phosphatase mptpA | ptpA
Type:
Hydrolase
Mol. Mass.:
17891.84
Organism:
Mycobacterium tuberculosis
Description:
Residue:
163
  
Inhibitor
Name:
BDBM50331860
Synonyms:
9-(Phenyl-phenylamino-methyl)-[1,4,7]triazecane-2,5,8-trione | CHEMBL1289457
Type:
Small organic molecule
Emp. Form.:
C20H22N4O3
Mol. Mass.:
366.4137
SMILES:
O=C1CNC(=O)CNC(=O)[C@H](CN1)[C@@H](Nc1ccccc1)c1ccccc1
: