Target
Metabotropic glutamate receptor 5
Ligand
BDBM50331978
Substrate
Meas. Tech.
ChEMBL_687528 (CHEMBL1292204)
EC50
210±n/a nM
Citation
 Xiong, HBrugel, TABalestra, MBrown, DGBrush, KAHightower, CHinkley, LHoesch, VKang, JKoether, GMMcCauley, JPMcLaren, FMPanko, LMSimpson, TRSmith, RWWoods, JMBrockel, BChhajlani, VGadient, RASpear, NSygowski, LAZhang, MArora, JBreysse, NWilson, JMIsaac, MSlassi, AKing, MM 4-aryl piperazine and piperidine amides as novel mGluR5 positive allosteric modulators. Bioorg Med Chem Lett 20:7381-4 (2010)  
Target
Name:
Metabotropic glutamate receptor 5
Synonyms:
GPRC1E GRM5_HUMAN metabotropic glutamate 5 | metabotropic glutamate 5a
Type:
Enzyme
Mol. Mass.:
132484.72
Organism:
Homo sapiens (Human)
Description:
Residue:
1212
  
Inhibitor
Name:
BDBM50331978
Synonyms:
5-((2-(4-(2,4-dichlorophenyl)piperazin-1-yl)-2-oxoethoxy)methyl)thiophene-2-carbonitrile | CHEMBL1290444
Type:
Small organic molecule
Emp. Form.:
C18H17Cl2N3O2S
Mol. Mass.:
410.317
SMILES:
Clc1ccc(N2CCN(CC2)C(=O)COCc2ccc(s2)C#N)c(Cl)c1
: