Target
Tyrosine-protein kinase JAK3
Ligand
BDBM50332598
Substrate
Meas. Tech.
ChEMBL_695928 (CHEMBL1641115)
IC50
29±n/a nM
Citation
 Flanagan, MEBlumenkopf, TABrissette, WHBrown, MFCasavant, JMShang-Poa, CDoty, JLElliott, EAFisher, MBHines, MKent, CKudlacz, EMLillie, BMMagnuson, KSMcCurdy, SPMunchhof, MJPerry, BDSawyer, PSStrelevitz, TJSubramanyam, CSun, JWhipple, DAChangelian, PS Discovery of CP-690,550: a potent and selective Janus kinase (JAK) inhibitor for the treatment of autoimmune diseases and organ transplant rejection. J Med Chem 53:8468-84 (2010)  
Target
Name:
Tyrosine-protein kinase JAK3
Synonyms:
JAK-3 JAK3_HUMAN Janus kinase 3 (JAK3) L-JAK | Leukocyte janus kinase
Type:
Protein
Mol. Mass.:
125111.08
Organism:
Homo sapiens (Human)
Description:
P52333
Residue:
1124
  
Inhibitor
Name:
BDBM50332598
Synonyms:
3-(4-Methyl-3-(methyl(7H-pyrrolo[2,3-d]pyrimidin-4-yl)amino)-piperidine-1-carbonyl)cyclopentanone | CHEMBL1630795
Type:
Small organic molecule
Emp. Form.:
C19H25N5O2
Mol. Mass.:
355.4341
SMILES:
CC1CCN(CC1N(C)c1ncnc2[nH]ccc12)C(=O)C1CCC(=O)C1
: