Target
Sodium-dependent noradrenaline transporter
Ligand
BDBM50333958
Substrate
Meas. Tech.
ChEMBL_700294 (CHEMBL1647512)
IC50
188±n/a nM
Citation
 Angus, DBingham, MBuchanan, DDunbar, NGibson, LGoodwin, RHaunsø, AHoughton, AHuggett, MMorphy, RNapier, SNimz, OPassmore, JWalker, G The identification, and optimisation of hERG selectivity, of a mixed NET/SERT re-uptake inhibitor for the treatment of pain. Bioorg Med Chem Lett 21:271-5 (2010)  
Target
Name:
Sodium-dependent noradrenaline transporter
Synonyms:
Monoamine transporter NET Noradrenaline Transporter (NET) Norepinephrine transporter protein (NET) SLC6A2 Sodium-dependent noradrenaline transporter (NET) | Solute carrier family 6 member 2
Type:
Multi-pass membrane protein
Mol. Mass.:
69337.72
Organism:
Homo sapiens (Human)
Description:
P23975
Residue:
617
  
Inhibitor
Name:
BDBM50333958
Synonyms:
CHEMBL1644475 | exo-(1R,5S)-3-(2-chlorophenoxy)-8-azabicyclo[3.2.1]octane
Type:
Small organic molecule
Emp. Form.:
C13H16ClNO
Mol. Mass.:
237.725
SMILES:
Clc1ccccc1O[C@H]1C[C@@H]2CC[C@H](C1)N2
: