Target
Sodium-dependent serotonin transporter
Ligand
BDBM50333973
Substrate
Meas. Tech.
ChEMBL_700295 (CHEMBL1647513)
IC50
105±n/a nM
Citation
 Angus, DBingham, MBuchanan, DDunbar, NGibson, LGoodwin, RHaunsø, AHoughton, AHuggett, MMorphy, RNapier, SNimz, OPassmore, JWalker, G The identification, and optimisation of hERG selectivity, of a mixed NET/SERT re-uptake inhibitor for the treatment of pain. Bioorg Med Chem Lett 21:271-5 (2010)  
Target
Name:
Sodium-dependent serotonin transporter
Synonyms:
5-HT Transporter 5HTT SC6A4_HUMAN SLC6A4 Serotonin transporter (5HTT) Sodium-dependent serotonin transporter (SERT) | Solute carrier family 6 member 4
Type:
Multi-pass membrane protein
Mol. Mass.:
70322.51
Organism:
Homo sapiens (Human)
Description:
P31645
Residue:
630
  
Inhibitor
Name:
BDBM50333973
Synonyms:
CHEMBL1644606 | exo-3'-((1R,5S)-8-azabicyclo[3.2.1]octan-3-yloxy)biphenyl-4-carbonitrile
Type:
Small organic molecule
Emp. Form.:
C20H20N2O
Mol. Mass.:
304.3856
SMILES:
N#Cc1ccc(cc1)-c1cccc(O[C@H]2C[C@@H]3CC[C@H](C2)N3)c1
: