Target
Transporter
Ligand
BDBM82217
Substrate
Meas. Tech.
ChEMBL_699309 (CHEMBL1647129)
IC50
22±n/a nM
Citation
 Shao, LWang, FMalcolm, SCMa, JHewitt, MCCampbell, UCBush, LRSpicer, NAEngel, SRSaraswat, LDHardy, LWKoch, PSchreiber, RSpear, KLVarney, MA Synthesis and pharmacological evaluation of 4-(3,4-dichlorophenyl)-N-methyl-1,2,3,4-tetrahydronaphthalenyl amines as triple reuptake inhibitors. Bioorg Med Chem 19:663-76 (2011)  
Target
Name:
Transporter
Synonyms:
NE transporter Norepinephrine transporter(NET)
Type:
Multi-pass membrane protein
Mol. Mass.:
69236.90
Organism:
Rattus norvegicus (rat)
Description:
Q63380
Residue:
617
  
Inhibitor
Name:
BDBM82217
Synonyms:
CHEMBL284994 SERTRALINE | [4-(3,4-Dichloro-phenyl)-1,2,3,4-tetrahydro-naphthalen-1-yl]-methyl-amine
Type:
Emp. Form.:
C17H17Cl2N
Mol. Mass.:
306.23
SMILES:
CN[C@@H]1CC[C@@H](c2ccc(Cl)c(Cl)c2)c2ccccc12
: