Target
Beta-galactosidase
Ligand
BDBM18356
Substrate
Meas. Tech.
ChEMBL_701784 (CHEMBL1656921)
IC50
700000±n/a nM
Citation
 Ghisaidoobe, ABikker, Pde Bruijn, ACGodschalk, FDRogaar, EGuijt, MCHagens, PHalma, JMHart, SMLuitjens, SBvan Rixel, VHWijzenbroek, MZweegers, TDonker-Koopman, WEStrijland, ABoot, RMarel, GvOverkleeft, HSAerts, JM Identification of Potent and Selective Glucosylceramide Synthase Inhibitors from a Library of N-Alkylated Iminosugars ACS Med Chem Lett 2:119-123 (2011)  
Target
Name:
Beta-galactosidase
Synonyms:
Acid beta-galactosidase Bgl Glb1 | Lactase
Type:
PROTEIN
Mol. Mass.:
73125.63
Organism:
Mus musculus
Description:
ChEMBL_701784
Residue:
647
  
Inhibitor
Name:
BDBM18356
Synonyms:
(2R,3R,4R,5S)-1-hexyl-2-(hydroxymethyl)piperidine-3,4,5-triol | N-Hexyl-DNJ
Type:
Small organic molecule
Emp. Form.:
C12H25NO4
Mol. Mass.:
247.3312
SMILES:
CCCCCCN1C[C@H](O)[C@@H](O)[C@H](O)[C@H]1CO
: