Target
Sucrase-isomaltase
Ligand
BDBM18356
Substrate
Meas. Tech.
ChEMBL_701783 (CHEMBL1656920)
IC50
1000±n/a nM
Citation
 Ghisaidoobe, ABikker, Pde Bruijn, ACGodschalk, FDRogaar, EGuijt, MCHagens, PHalma, JMHart, SMLuitjens, SBvan Rixel, VHWijzenbroek, MZweegers, TDonker-Koopman, WEStrijland, ABoot, RMarel, GvOverkleeft, HSAerts, JM Identification of Potent and Selective Glucosylceramide Synthase Inhibitors from a Library of N-Alkylated Iminosugars ACS Med Chem Lett 2:119-123 (2011)  
Target
Name:
Sucrase-isomaltase
Synonyms:
Type:
PROTEIN
Mol. Mass.:
209081.85
Organism:
Mus musculus
Description:
ChEMBL_701783
Residue:
1818
  
Inhibitor
Name:
BDBM18356
Synonyms:
(2R,3R,4R,5S)-1-hexyl-2-(hydroxymethyl)piperidine-3,4,5-triol | N-Hexyl-DNJ
Type:
Small organic molecule
Emp. Form.:
C12H25NO4
Mol. Mass.:
247.3312
SMILES:
CCCCCCN1C[C@H](O)[C@@H](O)[C@H](O)[C@H]1CO
: