Target
Lysosomal acid glucosylceramidase
Ligand
BDBM18356
Substrate
Meas. Tech.
ChEMBL_701781 (CHEMBL1656918)
IC50
80000±n/a nM
Citation
 Ghisaidoobe, ABikker, Pde Bruijn, ACGodschalk, FDRogaar, EGuijt, MCHagens, PHalma, JMHart, SMLuitjens, SBvan Rixel, VHWijzenbroek, MZweegers, TDonker-Koopman, WEStrijland, ABoot, RMarel, GvOverkleeft, HSAerts, JM Identification of Potent and Selective Glucosylceramide Synthase Inhibitors from a Library of N-Alkylated Iminosugars ACS Med Chem Lett 2:119-123 (2011)  
Target
Name:
Lysosomal acid glucosylceramidase
Synonyms:
Acid beta-glucosidase Beta-glucocerebrosidase D-glucosyl-N-acylsphingosine glucohydrolase GBA1 GC GLUC Glucosylceramidase (GBA) Glucosylceramidase precursor (Beta-glucocerebrosidase) (Acid beta-glucosidase) (D-glucosyl-N-acylsphingosine glucohydrolase) (Alglucerase) (Imiglucerase) beta-glucocerebrosidase (GCase)
Type:
Enzyme
Mol. Mass.:
59724.64
Organism:
Homo sapiens (Human)
Description:
The beta-Glu activity was measured with commercially available beta-glucocerebrosidase (Ceredase) as the enzyme source.
Residue:
536
  
Inhibitor
Name:
BDBM18356
Synonyms:
(2R,3R,4R,5S)-1-hexyl-2-(hydroxymethyl)piperidine-3,4,5-triol | N-Hexyl-DNJ
Type:
Small organic molecule
Emp. Form.:
C12H25NO4
Mol. Mass.:
247.3312
SMILES:
CCCCCCN1C[C@H](O)[C@@H](O)[C@H](O)[C@H]1CO
: