Target
Type-1 angiotensin II receptor
Ligand
BDBM50281823
Substrate
Meas. Tech.
ChEMBL_717437 (CHEMBL1670336)
IC50
4.9±n/a nM
Citation
 Naik, PMurumkar, PGiridhar, RYadav, MR Angiotensin II receptor type 1 (AT1) selective nonpeptidic antagonists--a perspective. Bioorg Med Chem 18:8418-56 (2010)  
Target
Name:
Type-1 angiotensin II receptor
Synonyms:
AGTR1 AGTR1B AT1 AT1BR AT2R1B Angiotensin II receptor Type-1 angiotensin II receptor (AT1)
Type:
Protein
Mol. Mass.:
41080.75
Organism:
Homo sapiens (Human)
Description:
P30556
Residue:
359
  
Inhibitor
Name:
BDBM50281823
Synonyms:
4-Butyl-1-((1R,2R,6S)-2,6-dimethyl-cyclohexyl)-3-{6-[2-(1H-tetrazol-5-yl)-phenyl]-pyridin-3-ylmethyl}-1,3-dihydro-imidazol-2-one SC-55634
Type:
Small organic molecule
Emp. Form.:
C28H35N7O
Mol. Mass.:
485.6238
SMILES:
CCCCc1cn([C@@H]2[C@@H](C)CCC[C@H]2C)c(=O)n1Cc1ccc(nc1)-c1ccccc1-c1nnn[nH]1
: