Target
Type-1 angiotensin II receptor
Ligand
BDBM50287290
Substrate
Meas. Tech.
ChEMBL_717329 (CHEMBL1669998)
IC50
0.4±n/a nM
Citation
 Naik, PMurumkar, PGiridhar, RYadav, MR Angiotensin II receptor type 1 (AT1) selective nonpeptidic antagonists--a perspective. Bioorg Med Chem 18:8418-56 (2010)  
Target
Name:
Type-1 angiotensin II receptor
Synonyms:
AGTR1 AGTR1B AT1 AT1BR AT2R1B Angiotensin II receptor Type-1 angiotensin II receptor (AT1)
Type:
Protein
Mol. Mass.:
41080.75
Organism:
Homo sapiens (Human)
Description:
P30556
Residue:
359
  
Inhibitor
Name:
BDBM50287290
Synonyms:
CHEMBL34866 Potassium; 2-[5-ethyl-3-[2'-(1H-tetrazol-5-yl)-biphenyl-4-ylmethyl]-3H-[1,3,4]thiadiazol-(2Z)-ylidenecarbamoyl]-cyclopent-1-enecarboxylate
Type:
Small organic molecule
Emp. Form.:
C25H22N7O3S
Mol. Mass.:
500.553
SMILES:
CCc1nn(Cc2ccc(cc2)-c2ccccc2-c2nnn[nH]2)c(=NC(=O)C2=C(CCC2)C([O-])=O)s1
: