Target
Type-1 angiotensin II receptor
Ligand
BDBM50044503
Substrate
Meas. Tech.
ChEMBL_717449 (CHEMBL1670348)
IC50
1.2±n/a nM
Citation
 Naik, PMurumkar, PGiridhar, RYadav, MR Angiotensin II receptor type 1 (AT1) selective nonpeptidic antagonists--a perspective. Bioorg Med Chem 18:8418-56 (2010)  
Target
Name:
Type-1 angiotensin II receptor
Synonyms:
AGTR1 ANGIOTENSIN AT1 Angiotensin II type 1a (AT-1a) receptor
Type:
Enzyme Catalytic Domain
Mol. Mass.:
41009.15
Organism:
RABBIT
Description:
ANGIOTENSIN AT1 AGTR1 RABBIT::P34976
Residue:
359
  
Inhibitor
Name:
BDBM50044503
Synonyms:
5-Butyl-2-(2,2-dimethyl-propyl)-4-[2'-(2H-tetrazol-5-yl)-biphenyl-4-ylmethyl]-2,4-dihydro-[1,2,4]triazol-3-one | CHEMBL19202
Type:
Small organic molecule
Emp. Form.:
C25H31N7O
Mol. Mass.:
445.5599
SMILES:
CCCCc1nn(CC(C)(C)C)c(=O)n1Cc1ccc(cc1)-c1ccccc1-c1nnn[nH]1
: