Target
Type-1 angiotensin II receptor
Ligand
BDBM50047826
Substrate
Meas. Tech.
ChEMBL_717437 (CHEMBL1670336)
IC50
1.4±n/a nM
Citation
 Naik, PMurumkar, PGiridhar, RYadav, MR Angiotensin II receptor type 1 (AT1) selective nonpeptidic antagonists--a perspective. Bioorg Med Chem 18:8418-56 (2010)  
Target
Name:
Type-1 angiotensin II receptor
Synonyms:
AGTR1 AGTR1B AT1 AT1BR AT2R1B Angiotensin II receptor Type-1 angiotensin II receptor (AT1)
Type:
Protein
Mol. Mass.:
41080.75
Organism:
Homo sapiens (Human)
Description:
P30556
Residue:
359
  
Inhibitor
Name:
BDBM50047826
Synonyms:
2-{5-Butyl-4-[2'-(1H-tetrazol-5-yl)-biphenyl-4-ylmethyl]-4H-[1,2,4]triazol-3-ylsulfanylmethyl}-benzoic acid | CHEMBL157577
Type:
Small organic molecule
Emp. Form.:
C28H27N7O2S
Mol. Mass.:
525.625
SMILES:
CCCCc1nnc(SCc2ccccc2C(O)=O)n1Cc1ccc(cc1)-c1ccccc1-c1nnn[nH]1
: