Target
Type-1 angiotensin II receptor
Ligand
BDBM50282613
Substrate
Meas. Tech.
ChEMBL_717329 (CHEMBL1669998)
IC50
1.8±n/a nM
Citation
 Naik, PMurumkar, PGiridhar, RYadav, MR Angiotensin II receptor type 1 (AT1) selective nonpeptidic antagonists--a perspective. Bioorg Med Chem 18:8418-56 (2010)  
Target
Name:
Type-1 angiotensin II receptor
Synonyms:
AGTR1 AGTR1B AT1 AT1BR AT2R1B Angiotensin II receptor Type-1 angiotensin II receptor (AT1)
Type:
Protein
Mol. Mass.:
41080.75
Organism:
Homo sapiens (Human)
Description:
P30556
Residue:
359
  
Inhibitor
Name:
BDBM50282613
Synonyms:
6-{2-Cyclopropyl-3-[2'-(1H-tetrazol-5-yl)-biphenyl-4-ylmethyl]-3H-benzoimidazol-5-yl}-5-methyl-4,5-dihydro-2H-pyridazin-3-one | CHEMBL24224
Type:
Small organic molecule
Emp. Form.:
C29H26N8O
Mol. Mass.:
502.5697
SMILES:
CC1CC(=O)NN=C1c1ccc2nc(C3CC3)n(Cc3ccc(cc3)-c3ccccc3-c3nnn[nH]3)c2c1
: