Target
Type-1 angiotensin II receptor
Ligand
BDBM50335923
Substrate
Meas. Tech.
ChEMBL_717437 (CHEMBL1670336)
Ki
29±n/a nM
Citation
 Naik, PMurumkar, PGiridhar, RYadav, MR Angiotensin II receptor type 1 (AT1) selective nonpeptidic antagonists--a perspective. Bioorg Med Chem 18:8418-56 (2010)  
Target
Name:
Type-1 angiotensin II receptor
Synonyms:
AGTR1 AGTR1B AT1 AT1BR AT2R1B Angiotensin II receptor Type-1 angiotensin II receptor (AT1)
Type:
Protein
Mol. Mass.:
41080.75
Organism:
Homo sapiens (Human)
Description:
P30556
Residue:
359
  
Inhibitor
Name:
BDBM50335923
Synonyms:
1-(2'-(1H-tetrazol-5-yl)biphenyl-4-yl)-2,2-difluoro-2-(2-propyl-1H-benzo[d]imidazol-1-yl)ethanol | CHEMBL1668003
Type:
Small organic molecule
Emp. Form.:
C25H22F2N6O
Mol. Mass.:
460.4786
SMILES:
CCCc1nc2ccccc2n1C(F)(F)C(O)c1ccc(cc1)-c1ccccc1-c1nnn[nH]1
: