Target
Type-1 angiotensin II receptor
Ligand
BDBM50038189
Substrate
Meas. Tech.
ChEMBL_717439 (CHEMBL1670338)
IC50
0.2±n/a nM
Citation
 Naik, PMurumkar, PGiridhar, RYadav, MR Angiotensin II receptor type 1 (AT1) selective nonpeptidic antagonists--a perspective. Bioorg Med Chem 18:8418-56 (2010)  
Target
Name:
Type-1 angiotensin II receptor
Synonyms:
AGTR1 ANGIOTENSIN AT1 Angiotensin II type 1a (AT-1a) receptor
Type:
Enzyme Catalytic Domain
Mol. Mass.:
41009.15
Organism:
RABBIT
Description:
ANGIOTENSIN AT1 AGTR1 RABBIT::P34976
Residue:
359
  
Inhibitor
Name:
BDBM50038189
Synonyms:
4'-(2-Ethyl-5,7-dimethyl-imidazo[4,5-b]pyridin-3-ylmethyl)-biphenyl-2-sulfonic acid benzoylamide L-158282 | MK-996
Type:
Small organic molecule
Emp. Form.:
C30H28N4O3S
Mol. Mass.:
524.633
SMILES:
CCc1nc2c(C)cc(C)nc2n1Cc1ccc(cc1)-c1ccccc1S(=O)(=O)NC(=O)c1ccccc1
: