Target
Type-1 angiotensin II receptor
Ligand
BDBM50043450
Substrate
Meas. Tech.
ChEMBL_717439 (CHEMBL1670338)
IC50
0.8±n/a nM
Citation
 Naik, PMurumkar, PGiridhar, RYadav, MR Angiotensin II receptor type 1 (AT1) selective nonpeptidic antagonists--a perspective. Bioorg Med Chem 18:8418-56 (2010)  
Target
Name:
Type-1 angiotensin II receptor
Synonyms:
AGTR1 ANGIOTENSIN AT1 Angiotensin II type 1a (AT-1a) receptor
Type:
Enzyme Catalytic Domain
Mol. Mass.:
41009.15
Organism:
RABBIT
Description:
ANGIOTENSIN AT1 AGTR1 RABBIT::P34976
Residue:
359
  
Inhibitor
Name:
BDBM50043450
Synonyms:
3,6-Dichloro-2-[5-(2-ethyl-5,7-dimethyl-3H-imidazo[4,5-b]pyridin-4-ylmethyl)-indole-1-carbonyl]-benzoic acid | CHEMBL337086
Type:
Small organic molecule
Emp. Form.:
C27H22Cl2N4O3
Mol. Mass.:
521.395
SMILES:
CCc1nc2c(C)cc(C)nc2n1Cc1ccc2n(ccc2c1)C(=O)c1c(Cl)ccc(Cl)c1C(O)=O
: