Target
Type-1 angiotensin II receptor
Ligand
BDBM50043434
Substrate
Meas. Tech.
ChEMBL_717439 (CHEMBL1670338)
IC50
1±n/a nM
Citation
 Naik, PMurumkar, PGiridhar, RYadav, MR Angiotensin II receptor type 1 (AT1) selective nonpeptidic antagonists--a perspective. Bioorg Med Chem 18:8418-56 (2010)  
Target
Name:
Type-1 angiotensin II receptor
Synonyms:
AGTR1 ANGIOTENSIN AT1 Angiotensin II type 1a (AT-1a) receptor
Type:
Enzyme Catalytic Domain
Mol. Mass.:
41009.15
Organism:
RABBIT
Description:
ANGIOTENSIN AT1 AGTR1 RABBIT::P34976
Residue:
359
  
Inhibitor
Name:
BDBM50043434
Synonyms:
2-Ethyl-5,7-dimethyl-4-{1-[phenyl-(1H-tetrazol-5-yl)-methyl]-2,3-dihydro-1H-indol-5-ylmethyl}-3H-imidazo[4,5-b]pyridine | CHEMBL442963
Type:
Small organic molecule
Emp. Form.:
C27H28N8
Mol. Mass.:
464.5648
SMILES:
CCc1nc2c(C)cc(C)nc2n1Cc1ccc2N(CCc2c1)C(c1nnn[nH]1)c1ccccc1
: