Target
Type-1 angiotensin II receptor
Ligand
BDBM50335924
Substrate
Meas. Tech.
ChEMBL_717437 (CHEMBL1670336)
IC50
4.7±n/a nM
Citation
 Naik, PMurumkar, PGiridhar, RYadav, MR Angiotensin II receptor type 1 (AT1) selective nonpeptidic antagonists--a perspective. Bioorg Med Chem 18:8418-56 (2010)  
Target
Name:
Type-1 angiotensin II receptor
Synonyms:
AGTR1 AGTR1B AT1 AT1BR AT2R1B Angiotensin II receptor Type-1 angiotensin II receptor (AT1)
Type:
Protein
Mol. Mass.:
41080.75
Organism:
Homo sapiens (Human)
Description:
P30556
Residue:
359
  
Inhibitor
Name:
BDBM50335924
Synonyms:
CHEMBL1668007 | benzyl 4'-((2-butyl-4-oxo-5-(2-oxo-2-(piperidin-1-yl)ethyl)-4,5-dihydro-3H-imidazo[4,5-c]pyridin-3-yl)methyl)-3'-fluorobiphenyl-2-ylsulfonylcarbamate
Type:
Small organic molecule
Emp. Form.:
C38H40FN5O6S
Mol. Mass.:
713.818
SMILES:
CCCCc1nc2ccn(CC(=O)N3CCCCC3)c(=O)c2n1Cc1ccc(cc1F)-c1ccccc1S(=O)(=O)NC(=O)OCc1ccccc1
: