Target
Type-2 angiotensin II receptor
Ligand
BDBM50335924
Substrate
Meas. Tech.
ChEMBL_717466 (CHEMBL1670671)
IC50
3.5±n/a nM
Citation
 Naik, PMurumkar, PGiridhar, RYadav, MR Angiotensin II receptor type 1 (AT1) selective nonpeptidic antagonists--a perspective. Bioorg Med Chem 18:8418-56 (2010)  
Target
Name:
Type-2 angiotensin II receptor
Synonyms:
AGTR2 AT2 Angiotensin II type 2 (AT-2) receptor Type-2 angiotensin II receptor
Type:
Enzyme Catalytic Domain
Mol. Mass.:
41201.61
Organism:
Homo sapiens (Human)
Description:
Angiotensin II, central 0 0::P50052
Residue:
363
  
Inhibitor
Name:
BDBM50335924
Synonyms:
CHEMBL1668007 | benzyl 4'-((2-butyl-4-oxo-5-(2-oxo-2-(piperidin-1-yl)ethyl)-4,5-dihydro-3H-imidazo[4,5-c]pyridin-3-yl)methyl)-3'-fluorobiphenyl-2-ylsulfonylcarbamate
Type:
Small organic molecule
Emp. Form.:
C38H40FN5O6S
Mol. Mass.:
713.818
SMILES:
CCCCc1nc2ccn(CC(=O)N3CCCCC3)c(=O)c2n1Cc1ccc(cc1F)-c1ccccc1S(=O)(=O)NC(=O)OCc1ccccc1
: