Target
Type-1 angiotensin II receptor
Ligand
BDBM50281797
Substrate
Meas. Tech.
ChEMBL_717437 (CHEMBL1670336)
IC50
22±n/a nM
Citation
 Naik, PMurumkar, PGiridhar, RYadav, MR Angiotensin II receptor type 1 (AT1) selective nonpeptidic antagonists--a perspective. Bioorg Med Chem 18:8418-56 (2010)  
Target
Name:
Type-1 angiotensin II receptor
Synonyms:
AGTR1 AGTR1B AT1 AT1BR AT2R1B Angiotensin II receptor Type-1 angiotensin II receptor (AT1)
Type:
Protein
Mol. Mass.:
41080.75
Organism:
Homo sapiens (Human)
Description:
P30556
Residue:
359
  
Inhibitor
Name:
BDBM50281797
Synonyms:
4'-(2-Butyl-7-oxo-6,7-dihydro-imidazo[4,5-d]pyridazin-1-ylmethyl)-biphenyl-2-carboxylic acid | CHEMBL7396
Type:
Small organic molecule
Emp. Form.:
C23H22N4O3
Mol. Mass.:
402.4458
SMILES:
CCCCc1nc2cn[nH]c(=O)c2n1Cc1ccc(cc1)-c1ccccc1C(O)=O
: