Target
Type-1 angiotensin II receptor
Ligand
BDBM50281802
Substrate
Meas. Tech.
ChEMBL_717437 (CHEMBL1670336)
IC50
17±n/a nM
Citation
 Naik, PMurumkar, PGiridhar, RYadav, MR Angiotensin II receptor type 1 (AT1) selective nonpeptidic antagonists--a perspective. Bioorg Med Chem 18:8418-56 (2010)  
Target
Name:
Type-1 angiotensin II receptor
Synonyms:
AGTR1 AGTR1B AT1 AT1BR AT2R1B Angiotensin II receptor Type-1 angiotensin II receptor (AT1)
Type:
Protein
Mol. Mass.:
41080.75
Organism:
Homo sapiens (Human)
Description:
P30556
Residue:
359
  
Inhibitor
Name:
BDBM50281802
Synonyms:
2-Butyl-1-[2'-(2H-tetrazol-5-yl)-biphenyl-4-ylmethyl]-5,6-dihydro-1H-imidazo[4,5-d]pyridazine-4,7-dione | CHEMBL267056
Type:
Small organic molecule
Emp. Form.:
C23H22N8O2
Mol. Mass.:
442.4732
SMILES:
CCCCc1nc2c(n1Cc1ccc(cc1)-c1ccccc1-c1nnn[nH]1)c(=O)[nH][nH]c2=O
: