Target
Type-1 angiotensin II receptor
Ligand
BDBM50039342
Substrate
Meas. Tech.
ChEMBL_717437 (CHEMBL1670336)
Ki
24±n/a nM
Citation
 Naik, PMurumkar, PGiridhar, RYadav, MR Angiotensin II receptor type 1 (AT1) selective nonpeptidic antagonists--a perspective. Bioorg Med Chem 18:8418-56 (2010)  
Target
Name:
Type-1 angiotensin II receptor
Synonyms:
AGTR1 AGTR1B AT1 AT1BR AT2R1B Angiotensin II receptor Type-1 angiotensin II receptor (AT1)
Type:
Protein
Mol. Mass.:
41080.75
Organism:
Homo sapiens (Human)
Description:
P30556
Residue:
359
  
Inhibitor
Name:
BDBM50039342
Synonyms:
5-Methyl-7-propyl-8-[2'-(1H-tetrazol-5-yl)-biphenyl-4-ylmethyl]-3H-[1,2,4]triazolo[1,5-c]pyrimidin-2-ol CHEMBL312104
Type:
Small organic molecule
Emp. Form.:
C23H22N8O
Mol. Mass.:
426.4738
SMILES:
CCCc1nc(C)n2[nH]c(=O)nc2c1Cc1ccc(cc1)-c1ccccc1-c1nnn[nH]1
: