Target
Type-1 angiotensin II receptor
Ligand
BDBM50049207
Substrate
Meas. Tech.
ChEMBL_717437 (CHEMBL1670336)
IC50
6±n/a nM
Citation
 Naik, PMurumkar, PGiridhar, RYadav, MR Angiotensin II receptor type 1 (AT1) selective nonpeptidic antagonists--a perspective. Bioorg Med Chem 18:8418-56 (2010)  
Target
Name:
Type-1 angiotensin II receptor
Synonyms:
AGTR1 AGTR1B AT1 AT1BR AT2R1B Angiotensin II receptor Type-1 angiotensin II receptor (AT1)
Type:
Protein
Mol. Mass.:
41080.75
Organism:
Homo sapiens (Human)
Description:
P30556
Residue:
359
  
Inhibitor
Name:
BDBM50049207
Synonyms:
2-Butyl-6-(1-methoxy-1-methyl-ethyl)-3-[2'-(1H-tetrazol-5-yl)-biphenyl-4-ylmethyl]-3H-quinazolin-4-one CL-329167
Type:
Small organic molecule
Emp. Form.:
C30H32N6O2
Mol. Mass.:
508.6141
SMILES:
CCCCc1nc2ccc(cc2c(=O)n1Cc1ccc(cc1)-c1ccccc1-c1nnn[nH]1)C(C)(C)OC
: