Target
Type-2 angiotensin II receptor
Ligand
BDBM50044739
Substrate
Meas. Tech.
ChEMBL_717466 (CHEMBL1670671)
Ki
4.5±n/a nM
Citation
 Naik, PMurumkar, PGiridhar, RYadav, MR Angiotensin II receptor type 1 (AT1) selective nonpeptidic antagonists--a perspective. Bioorg Med Chem 18:8418-56 (2010)  
Target
Name:
Type-2 angiotensin II receptor
Synonyms:
AGTR2 AT2 Angiotensin II type 2 (AT-2) receptor Type-2 angiotensin II receptor
Type:
Enzyme Catalytic Domain
Mol. Mass.:
41201.61
Organism:
Homo sapiens (Human)
Description:
Angiotensin II, central 0 0::P50052
Residue:
363
  
Inhibitor
Name:
BDBM50044739
Synonyms:
3-Butyl-2-[2'-(1H-tetrazol-5-yl)-biphenyl-4-yloxy]-quinoxaline 1-oxide | CHEMBL77029
Type:
Small organic molecule
Emp. Form.:
C25H22N6O2
Mol. Mass.:
438.4812
SMILES:
CCCCc1nc2ccccc2[n+]([O-])c1Oc1ccc(cc1)-c1ccccc1-c1nnn[nH]1
: