Target
Type-1 angiotensin II receptor
Ligand
BDBM50049187
Substrate
Meas. Tech.
ChEMBL_717480 (CHEMBL1670685)
IC50
3.8±n/a nM
Citation
 Naik, PMurumkar, PGiridhar, RYadav, MR Angiotensin II receptor type 1 (AT1) selective nonpeptidic antagonists--a perspective. Bioorg Med Chem 18:8418-56 (2010)  
Target
Name:
Type-1 angiotensin II receptor
Synonyms:
AGTR1 AT1 | Angiotensin II type-1 receptor
Type:
PROTEIN
Mol. Mass.:
41004.19
Organism:
Cavia porcellus
Description:
ChEMBL_36783
Residue:
359
  
Inhibitor
Name:
BDBM50049187
Synonyms:
5,7-Diethyl-1-[2'-(1H-tetrazol-5-yl)-biphenyl-4-ylmethyl]-3,4-dihydro-1H-[1,6]naphthyridin-2-one ZD-7155
Type:
Small organic molecule
Emp. Form.:
C26H26N6O
Mol. Mass.:
438.5242
SMILES:
CCc1cc2N(Cc3ccc(cc3)-c3ccccc3-c3nnn[nH]3)C(=O)CCc2c(CC)n1
: