Target
Type-1 angiotensin II receptor
Ligand
BDBM50335928
Substrate
Meas. Tech.
ChEMBL_717439 (CHEMBL1670338)
IC50
0.77±n/a nM
Citation
 Naik, PMurumkar, PGiridhar, RYadav, MR Angiotensin II receptor type 1 (AT1) selective nonpeptidic antagonists--a perspective. Bioorg Med Chem 18:8418-56 (2010)  
Target
Name:
Type-1 angiotensin II receptor
Synonyms:
AGTR1 ANGIOTENSIN AT1 Angiotensin II type 1a (AT-1a) receptor
Type:
Enzyme Catalytic Domain
Mol. Mass.:
41009.15
Organism:
RABBIT
Description:
ANGIOTENSIN AT1 AGTR1 RABBIT::P34976
Residue:
359
  
Inhibitor
Name:
BDBM50335928
Synonyms:
(R)-1-((2'-(1H-tetrazol-5-yl)biphenyl-4-yl)methyl)-2-butyl-4-cyclohexyl-4-methyl-1H-imidazol-5(4H)-one | CHEMBL1667998
Type:
Small organic molecule
Emp. Form.:
C28H34N6O
Mol. Mass.:
470.6092
SMILES:
CCCCC1=N[C@](C)(C2CCCCC2)C(=O)N1Cc1ccc(cc1)-c1ccccc1-c1nnn[nH]1
: