Target
Type-1 angiotensin II receptor
Ligand
BDBM50042580
Substrate
Meas. Tech.
ChEMBL_717412 (CHEMBL1670311)
IC50
0.55±n/a nM
Citation
 Naik, PMurumkar, PGiridhar, RYadav, MR Angiotensin II receptor type 1 (AT1) selective nonpeptidic antagonists--a perspective. Bioorg Med Chem 18:8418-56 (2010)  
Target
Name:
Type-1 angiotensin II receptor
Synonyms:
AGTR1 ANGIOTENSIN AT1 Angiotensin II type 1a (AT-1a) receptor
Type:
Enzyme Catalytic Domain
Mol. Mass.:
41009.15
Organism:
RABBIT
Description:
ANGIOTENSIN AT1 AGTR1 RABBIT::P34976
Residue:
359
  
Inhibitor
Name:
BDBM50042580
Synonyms:
2-Butyl-5-(2-chloro-phenyl)-3-[2'-(1H-tetrazol-5-yl)-biphenyl-4-ylmethyl]-3H-imidazole-4-carboxylic acid | CHEMBL332897
Type:
Small organic molecule
Emp. Form.:
C28H25ClN6O2
Mol. Mass.:
512.99
SMILES:
CCCCc1nc(c(C(O)=O)n1Cc1ccc(cc1)-c1ccccc1-c1nnn[nH]1)-c1ccccc1Cl
: