Target
Type-1 angiotensin II receptor
Ligand
BDBM50046078
Substrate
Meas. Tech.
ChEMBL_717437 (CHEMBL1670336)
IC50
5.6±n/a nM
Citation
 Naik, PMurumkar, PGiridhar, RYadav, MR Angiotensin II receptor type 1 (AT1) selective nonpeptidic antagonists--a perspective. Bioorg Med Chem 18:8418-56 (2010)  
Target
Name:
Type-1 angiotensin II receptor
Synonyms:
AGTR1 AGTR1B AT1 AT1BR AT2R1B Angiotensin II receptor Type-1 angiotensin II receptor (AT1)
Type:
Protein
Mol. Mass.:
41080.75
Organism:
Homo sapiens (Human)
Description:
P30556
Residue:
359
  
Inhibitor
Name:
BDBM50046078
Synonyms:
5-[4'-(3,5-Dibutyl-[1,2,4]triazol-1-ylmethyl)-biphenyl-2-yl]-1H-tetrazole CHEMBL85595 | SC-50560
Type:
Small organic molecule
Emp. Form.:
C24H29N7
Mol. Mass.:
415.534
SMILES:
CCCCc1nc(CCCC)n(Cc2ccc(cc2)-c2ccccc2-c2nnn[nH]2)n1
: