Target
Type-1 angiotensin II receptor
Ligand
BDBM50335929
Substrate
Meas. Tech.
ChEMBL_717445 (CHEMBL1670344)
IC50
22±n/a nM
Citation
 Naik, PMurumkar, PGiridhar, RYadav, MR Angiotensin II receptor type 1 (AT1) selective nonpeptidic antagonists--a perspective. Bioorg Med Chem 18:8418-56 (2010)  
Target
Name:
Type-1 angiotensin II receptor
Synonyms:
AGTR1 AGTR1B AT1 AT1BR AT2R1B Angiotensin II receptor Type-1 angiotensin II receptor (AT1)
Type:
Protein
Mol. Mass.:
41080.75
Organism:
Homo sapiens (Human)
Description:
P30556
Residue:
359
  
Inhibitor
Name:
BDBM50335929
Synonyms:
2-((2'-(1H-tetrazol-5-yl)biphenyl-4-yl)methyl)-3-butyl-2,3-diazaspiro[4.4]nonane-6,9-dione | CHEMBL1667999
Type:
Small organic molecule
Emp. Form.:
C25H28N6O2
Mol. Mass.:
444.5288
SMILES:
CCCCN1CC2(CN1Cc1ccc(cc1)-c1ccccc1-c1nnn[nH]1)C(=O)CCC2=O
: