Target
Type-1 angiotensin II receptor
Ligand
BDBM50335930
Substrate
Meas. Tech.
ChEMBL_717445 (CHEMBL1670344)
IC50
12±n/a nM
Citation
 Naik, PMurumkar, PGiridhar, RYadav, MR Angiotensin II receptor type 1 (AT1) selective nonpeptidic antagonists--a perspective. Bioorg Med Chem 18:8418-56 (2010)  
Target
Name:
Type-1 angiotensin II receptor
Synonyms:
AGTR1 AGTR1B AT1 AT1BR AT2R1B Angiotensin II receptor Type-1 angiotensin II receptor (AT1)
Type:
Protein
Mol. Mass.:
41080.75
Organism:
Homo sapiens (Human)
Description:
P30556
Residue:
359
  
Inhibitor
Name:
BDBM50335930
Synonyms:
CHEMBL1668000 | N-(4'-((3-butyl-6,9-dioxo-2,3-diazaspiro[4.4]nonan-2-yl)methyl)biphenyl-2-ylsulfonyl)benzamide
Type:
Small organic molecule
Emp. Form.:
C31H33N3O5S
Mol. Mass.:
559.676
SMILES:
CCCCN1CC2(CN1Cc1ccc(cc1)-c1ccccc1S(=O)(=O)NC(=O)c1ccccc1)C(=O)CCC2=O
: