Target
Type-1 angiotensin II receptor
Ligand
BDBM50281822
Substrate
Meas. Tech.
ChEMBL_717437 (CHEMBL1670336)
IC50
12±n/a nM
Citation
 Naik, PMurumkar, PGiridhar, RYadav, MR Angiotensin II receptor type 1 (AT1) selective nonpeptidic antagonists--a perspective. Bioorg Med Chem 18:8418-56 (2010)  
Target
Name:
Type-1 angiotensin II receptor
Synonyms:
AGTR1 AGTR1B AT1 AT1BR AT2R1B Angiotensin II receptor Type-1 angiotensin II receptor (AT1)
Type:
Protein
Mol. Mass.:
41080.75
Organism:
Homo sapiens (Human)
Description:
P30556
Residue:
359
  
Inhibitor
Name:
BDBM50281822
Synonyms:
1,4-Dibutyl-3-[2'-(1H-tetrazol-5-yl)-biphenyl-4-ylmethyl]-1,3-dihydro-imidazol-2-one SC-51895
Type:
Small organic molecule
Emp. Form.:
C25H30N6O
Mol. Mass.:
430.5453
SMILES:
CCCCc1cn(CCCC)c(=O)n1Cc1ccc(cc1)-c1ccccc1-c1nnn[nH]1
: