Target
Type-1 angiotensin II receptor
Ligand
BDBM50042534
Substrate
Meas. Tech.
ChEMBL_717323 (CHEMBL1669992)
IC50
0.42±n/a nM
Citation
 Naik, PMurumkar, PGiridhar, RYadav, MR Angiotensin II receptor type 1 (AT1) selective nonpeptidic antagonists--a perspective. Bioorg Med Chem 18:8418-56 (2010)  
Target
Name:
Type-1 angiotensin II receptor
Synonyms:
AGTR1 ANGIOTENSIN AT1 Angiotensin II type 1a (AT-1a) receptor
Type:
Enzyme Catalytic Domain
Mol. Mass.:
41009.15
Organism:
RABBIT
Description:
ANGIOTENSIN AT1 AGTR1 RABBIT::P34976
Residue:
359
  
Inhibitor
Name:
BDBM50042534
Synonyms:
2-Benzyl-5-propyl-4-[2'-(1H-tetrazol-5-yl)-biphenyl-4-ylmethyl]-2H-pyrazole-3-carboxylic acid | CHEMBL334145
Type:
Small organic molecule
Emp. Form.:
C28H26N6O2
Mol. Mass.:
478.545
SMILES:
CCCc1nn(Cc2ccccc2)c(C(O)=O)c1Cc1ccc(cc1)-c1ccccc1-c1nnn[nH]1
: