Target
Cathepsin L2
Ligand
BDBM50336044
Substrate
Meas. Tech.
ChEMBL_717669 (CHEMBL1670800)
IC50
>10000±n/a nM
Citation
 Arbuckle, WBaugh, MBelshaw, SBennett, DJBruin, JCai, JCameron, KSClaxton, CDempster, MEverett, KFradera, XHamilton, WJones, PSKinghorn, ELong, CMartin, IRobinson, JWestwood, P 1H-imidazo[4,5-c]pyridine-4-carbonitrile as cathepsin S inhibitors: separation of desired cellular activity from undesired tissue accumulation through optimization of basic nitrogen pka. Bioorg Med Chem Lett 21:932-5 (2011)  
Target
Name:
Cathepsin L2
Synonyms:
CATL2 CTSL2 CTSV Cathepsin V
Type:
Enzyme
Mol. Mass.:
37341.06
Organism:
Homo sapiens (Human)
Description:
O60911
Residue:
334
  
Inhibitor
Name:
BDBM50336044
Synonyms:
6-(4-(2-(1-((3,5-dimethylisoxazol-4-yl)methyl)piperidin-4-yl)ethoxy)-3-(trifluoromethyl)phenyl)-1-methyl-1H-imidazo[4,5-c]pyridine-4-carbonitrile | CHEMBL1669277
Type:
Small organic molecule
Emp. Form.:
C28H29F3N6O2
Mol. Mass.:
538.5641
SMILES:
Cc1noc(C)c1CN1CCC(CCOc2ccc(cc2C(F)(F)F)-c2cc3n(C)cnc3c(n2)C#N)CC1
: