Target
Prostaglandin D2 receptor 2
Ligand
BDBM50338157
Substrate
Meas. Tech.
ChEMBL_727759 (CHEMBL1686118)
IC50
31000±n/a nM
Citation
 Bonafoux, DAbibi, ABettencourt, BBurchat, AEricsson, AHarris, CMKebede, TMorytko, MMcPherson, MWallace, GWu, X Thienopyrrole acetic acids as antagonists of the CRTH2 receptor. Bioorg Med Chem Lett 21:1861-4 (2011)  
Target
Name:
Prostaglandin D2 receptor 2
Synonyms:
CD_antigen=CD294 Chemoattractant Receptor-homologous molecule expressed on T-helper type 2 cells (CRTH2) Chemoattractant receptor-homologous molecule expressed on Th2 cells (CRTH2) G protein-coupled receptor 44 GPR44 PTGDR2 Prostaglandin D2 receptor 2 | Prostaglandin D2 receptor 2 (PGD2)
Type:
Enzyme
Mol. Mass.:
43295.45
Organism:
Homo sapiens (Human)
Description:
Q9Y5Y4
Residue:
395
  
Inhibitor
Name:
BDBM50338157
Synonyms:
2-(6-(4-(N-cyclohexyl-N-methylsulfamoyl)benzyl)-5-methyl-6H-thieno[2,3-b]pyrrol-4-yl)acetic acid | CHEMBL1684726
Type:
Small organic molecule
Emp. Form.:
C23H28N2O4S2
Mol. Mass.:
460.609
SMILES:
CN(C1CCCCC1)S(=O)(=O)c1ccc(Cn2c(C)c(CC(O)=O)c3ccsc23)cc1
: