Target
Proto-oncogene tyrosine-protein kinase Src
Ligand
BDBM50341530
Substrate
Meas. Tech.
ChEMBL_742159 (CHEMBL1769219)
Ki
40±n/a nM
Citation
 Charrier, JDMiller, AKay, DPBrenchley, GTwin, HCCollier, PNRamaya, SKeily, SBDurrant, SJKnegtel, RMTanner, AJBrown, KCurnock, APJimenez, JM Discovery and structure-activity relationship of 3-aminopyrid-2-ones as potent and selective interleukin-2 inducible T-cell kinase (Itk) inhibitors. J Med Chem 54:2341-50 (2011)  
Target
Name:
Proto-oncogene tyrosine-protein kinase Src
Synonyms:
Calmodulin/Proto-oncogene tyrosine-protein kinase Src Proto-oncogene c-Src SRC SRC_HUMAN V-src sarcoma (Schmidt-Ruppin A-2) viral oncogene homolog (avian) p60-Src | pp60c-src
Type:
Protein
Mol. Mass.:
59838.60
Organism:
Homo sapiens (Human)
Description:
P12931
Residue:
536
  
Inhibitor
Name:
BDBM50341530
Synonyms:
3-(4-(Piperidin-1-yl)benzoylamino)-5-(2-(methylamino)pyrimidin-4-yl)-(1H)-pyridin-2-one N-{5-[2-(methylamino)pyrimidin-4-yl]-2-oxo-1,2-dihydropyridin-3-yl}-4-(piperidin-1-yl)benzamide
Type:
Small organic molecule
Emp. Form.:
C22H24N6O2
Mol. Mass.:
404.465
SMILES:
CNc1nccc(n1)-c1c[nH]c(=O)c(NC(=O)c2ccc(cc2)N2CCCCC2)c1
: