Target
Mitogen-activated protein kinase kinase kinase 5
Ligand
BDBM50342272
Substrate
Meas. Tech.
ChEMBL_743863 (CHEMBL1767806)
IC50
4700±n/a nM
Citation
 Volynets, GPChekanov, MOSynyugin, ARGolub, AGKukharenko, OPBdzhola, VGYarmoluk, SM Identification of 3H-naphtho[1,2,3-de]quinoline-2,7-diones as inhibitors of apoptosis signal-regulating kinase 1 (ASK1). J Med Chem 54:2680-6 (2011)  
Target
Name:
Mitogen-activated protein kinase kinase kinase 5
Synonyms:
ASK1 MAP3K5 MEKK5
Type:
Protein
Mol. Mass.:
154514.93
Organism:
Homo sapiens (Human)
Description:
Q99683
Residue:
1374
  
Inhibitor
Name:
BDBM50342272
Synonyms:
3-Methyl-1-(methylamino)-3H-naphtho[1,2,3-de]quinoline-2,7-dione | CHEMBL1767077
Type:
Small organic molecule
Emp. Form.:
C18H14N2O2
Mol. Mass.:
290.316
SMILES:
CNc1c2-c3ccccc3C(=O)c3cccc(n(C)c1=O)c23
: